{"text_format":"1","workbook":"xlsx","n_sheets":22,"sheets":["Contents","Key Assumptions >","Transport Demand","Technology Scenarios","Energy Demand","Results Tools >","Total Energy Demand","Regional Comparison","Energy Demand by Mode","Energy Demand Explorer","Energy Demand Tables >","Full Results","Shipping Summary","Data_Explorer_Backend","Aviation Summary","Ferries Summary","Rail Summary","Results_Backend","Bus Summary","Car Summary","HGV Summary","Van Summary"],"not_rendered":{"charts":8,"images":8,"macros":1,"external_links":5,"defined_names":39,"comments":0,"pivot_tables":1},"unopened":[],"bounds":{"document_bytes":16777216,"sheet_cells":100000,"rows_first":2000,"rows_last":500,"rows_between":2000,"halvings":0,"cell_chars":16384,"cell_head_chars":4096},"cells_cut":0,"cells_raw":0,"read":"whole","date_system":"1900"}

{"sheet":"Contents","index":0,"n_rows":35,"n_cols":4,"rows_kept":35,"cut":false,"hidden":false,"merged":[[13,1,15,1],[17,1,21,1],[23,1,25,1]]}
[]
[]
[]
[]
[]
[null,null,"Zero Emission Energy for Transport:","Regional Demand Forecasts for Hydrogen - Excel Tool"]
{"$rows_left_out":30}
{"sheet":"Key Assumptions >","index":1,"n_rows":23,"n_cols":3,"rows_kept":23,"cut":false,"hidden":false,"merged":[[19,1,19,4],[20,1,20,4],[21,1,21,4],[22,1,22,4],[16,1,16,4],[13,1,13,4],[9,2,9,4],[8,2,8,4],[14,1,14,4],[15,1,15,4]]}
[]
[]
[null,null,"Key Assumptions: Overview and Section Tab >"]
[]
[]
[]
{"$rows_left_out":18}
{"sheet":"Transport Demand","index":2,"n_rows":45,"n_cols":6,"rows_kept":45,"cut":false,"hidden":false,"merged":[[10,2,10,5],[27,4,32,5],[27,2,32,3],[26,2,26,3],[44,2,44,5],[38,3,43,3],[38,2,43,2],[38,4,43,4],[38,5,43,5],[7,1,7,5],[14,1,14,5],[25,1,25,5],[36,1,36,5],[16,3,16,4],[19,3,19,4],[18,3,18,4],[17,3,17,4],[24,2,24,3],[20,3,20,4],[21,2,21,5],[19,2,20,2],[33,2,33,5],[26,4,26,5],[15,3,15,4],[23,2,23,3]]}
[]
[]
[null,null,"Key Assumptions: Transport Demand"]
[]
[]
[]
{"$rows_left_out":40}
{"sheet":"Technology Scenarios","index":3,"n_rows":41,"n_cols":6,"rows_kept":41,"cut":false,"hidden":false,"merged":[[26,3,26,5],[25,1,25,5],[39,2,39,5],[30,2,30,5],[31,2,31,5],[27,3,27,5],[28,3,28,5],[29,3,29,5],[40,2,40,5],[35,1,35,5],[36,1,36,5],[37,2,37,5],[38,2,38,5],[12,2,12,5],[21,2,21,5],[20,2,20,5],[19,2,19,5],[18,2,18,5],[17,1,17,5]]}
[]
[]
[null,null,"Key Assumptions: Technology Transition Scenarios"]
[]
[]
[]
{"$rows_left_out":36}
{"sheet":"Energy Demand","index":4,"n_rows":57,"n_cols":8,"rows_kept":57,"cut":false,"hidden":false,"merged":[[10,7,15,7],[34,4,37,4],[46,4,48,4]]}
[]
[]
[]
[null,null,"Key Assumptions: Energy Demand Analysis"]
[]
[]
{"$rows_left_out":52}
{"sheet":"Results Tools >","index":5,"n_rows":12,"n_cols":3,"rows_kept":12,"cut":false,"hidden":false,"merged":[]}
[]
[]
[]
[]
[]
[null,null,"Results Tools - Overview and Section Tab >"]
{"$rows_left_out":7}
{"sheet":"Total Energy Demand","index":6,"n_rows":88,"n_cols":6,"rows_kept":88,"cut":false,"hidden":false,"merged":[[11,1,11,2]]}
[]
[]
[]
[]
[]
[null,"Total Energy Demand Excel Tool "]
{"$rows_left_out":83}
{"sheet":"Regional Comparison","index":7,"n_rows":10,"n_cols":2,"rows_kept":10,"cut":false,"hidden":false,"merged":[]}
[]
[]
[]
[]
[]
[null,"Regional Comparison"]
{"$rows_left_out":5}
{"sheet":"Energy Demand by Mode","index":8,"n_rows":14,"n_cols":2,"rows_kept":14,"cut":false,"hidden":false,"merged":[[13,0,13,1]]}
[]
[]
[]
[]
[]
[null,"Energy Demand by Mode Excel Tool "]
{"$rows_left_out":9}
{"sheet":"Energy Demand Explorer","index":9,"n_rows":39,"n_cols":17,"rows_kept":39,"cut":false,"hidden":false,"merged":[[14,1,15,1],[30,3,32,3],[33,3,35,3],[36,3,38,3]]}
[]
[]
[]
[]
[]
[null,"Energy Demand Explorer Excel Tool "]
{"$rows_left_out":34}
{"sheet":"Energy Demand Tables >","index":10,"n_rows":6,"n_cols":3,"rows_kept":6,"cut":false,"hidden":false,"merged":[]}
[]
[]
[]
[]
[]
[null,null,"Energy Demand Tables - Section Tab >"]
{"$rows_left_out":1}
{"sheet":"Full Results","index":11,"n_rows":90,"n_cols":14,"rows_kept":90,"cut":false,"hidden":false,"merged":[[8,12,9,12],[8,13,9,13],[8,7,9,7],[8,8,9,8],[8,9,9,9],[8,10,9,10],[8,11,9,11],[8,2,9,2],[8,3,9,3],[8,4,9,4],[8,5,9,5],[8,6,9,6],[72,0,72,12],[75,0,75,12],[78,0,78,12],[55,0,55,12],[62,0,62,12],[14,0,14,13],[47,0,47,13],[71,0,71,13],[15,0,15,13],[20,0,20,13],[25,0,25,13],[33,0,33,13],[37,0,37,13],[41,0,41,13],[32,0,32,13],[48,0,48,13]]}
[]
[]
[]
[null,null,"Full Results Table"]
[]
[]
{"$rows_left_out":85}
{"sheet":"Shipping Summary","index":12,"n_rows":37,"n_cols":22,"rows_kept":37,"cut":false,"hidden":true,"merged":[[9,1,12,1],[13,1,16,1],[17,1,20,1]]}
[null,0]
[null,null,"ZEEfT - ZEEfT - Shipping"]
[]
[]
[null,null,"Summary Tables for Zero Emission Shipping"]
[null,null,null,null,"E","F","G","H","I","J","K","L","M","N","O","P","Q","R","S"]
{"$rows_left_out":32}
{"sheet":"Data_Explorer_Backend","index":13,"n_rows":311,"n_cols":58,"rows_kept":311,"cut":false,"hidden":true,"merged":[[287,0,298,0],[152,0,163,0],[164,0,175,0],[176,0,187,0],[188,0,199,0],[200,0,211,0],[212,0,223,0],[227,0,238,0],[239,0,250,0],[251,0,262,0],[263,0,274,0],[275,0,286,0],[225,24,225,36],[137,0,148,0],[2,0,13,0],[14,0,25,0],[26,0,37,0],[38,0,49,0],[50,0,61,0],[62,0,73,0],[77,0,88,0],[89,0,100,0],[101,0,112,0],[113,0,124,0],[125,0,136,0]]}
["Aviation"]
[null,null,"Hydrogen","Electricity","LH2 Narrow Body","LH2 Regional","LH2 Wide Body","Elec Regional","Elec Small Turbo","Elec Large Turbo",null,null,null,null,null,null,null,null,null,null,null,null,null,null,null,2022,2023,2024,2025,2026,2027,2028,2029,2030,2035,2040,2045,null,null,null,"Scenario A: Low Hydrogen",2022,2023,2024,2025,2026,2027,2028,2029,2030,2035,2040,2045,null,null,"Aviation","Scenario A: Low Hydrogen","kWh"]
["Scenario A: Low Hydrogen",2022,{"$f":"SUM(E3:G3)","v":0},{"$f":"SUM(H3:J3)","v":0},{"$f":"TRANSPOSE(Z3:AK5)","v":0},0,0,{"$f":"TRANSPOSE(Z7:AK9)","v":0},0,0,null,null,null,null,null,null,null,null,null,null,null,null,null,"Scenario A: Low Hydrogen","LH2 Narrow Body",{"$f":"'Aviation Summary'!G12","v":0},{"$f":"'Aviation Summary'!H12","v":0},{"$f":"'Aviation Summary'!I12","v":0},{"$f":"'Aviation Summary'!J12","v":0},{"$f":"'Aviation Summary'!K12","v":0},{"$f":"'Aviation Summary'!L12","v":0},{"$f":"'Aviation Summary'!M12","v":0},{"$f":"'Aviation Summary'!N12","v":0},{"$f":"'Aviation Summary'!O12","v":0},{"$f":"'Aviation Summary'!P12","v":0},{"$f":"'Aviation Summary'!Q12","v":0},{"$f":"'Aviation Summary'!R12","v":0},null,null,null,"Aviation",{"$f":"Z6","v":0},{"$f":"AA6","v":0},{"$f":"AB6","v":0},0,0,0,0,0,0,0,0,0,null,null,"Maritime","Scenario B: Medium Hydrogen","MWh"]
[null,2023,{"$f":"SUM(E4:G4)","v":0},0,0,0,0,0,0,0,null,null,null,null,null,null,null,null,null,null,null,null,null,null,"LH2 Regional",{"$f":"'Aviation Summary'!G13","v":0},{"$f":"'Aviation Summary'!H13","v":0},{"$f":"'Aviation Summary'!I13","v":0},{"$f":"'Aviation Summary'!J13","v":0},{"$f":"'Aviation Summary'!K13","v":0},{"$f":"'Aviation Summary'!L13","v":0},{"$f":"'Aviation Summary'!M13","v":0},{"$f":"'Aviation Summary'!N13","v":0},{"$f":"'Aviation Summary'!O13","v":0},{"$f":"'Aviation Summary'!P13","v":0},{"$f":"'Aviation Summary'!Q13","v":0},{"$f":"'Aviation Summary'!R13","v":0},null,null,null,"Maritime",{"$f":"Z80","v":0},{"$f":"AA80","v":0},0,0,0,0,0,0,86696.122450863768,216807391.68164262,1153609257.3384087,{"$f":"AK80","v":1154092472.6326945},null,null,"Road","Scenario C: High Hydrogen","GWh"]
[null,2024,0,0,0,0,0,0,0,0,null,null,null,null,null,null,null,null,null,null,null,null,null,null,"LH2 Wide Body",{"$f":"'Aviation Summary'!G14","v":0},{"$f":"'Aviation Summary'!H14","v":0},{"$f":"'Aviation Summary'!I14","v":0},{"$f":"'Aviation Summary'!J14","v":0},{"$f":"'Aviation Summary'!K14","v":0},{"$f":"'Aviation Summary'!L14","v":0},{"$f":"'Aviation Summary'!M14","v":0},{"$f":"'Aviation Summary'!N14","v":0},{"$f":"'Aviation Summary'!O14","v":0},{"$f":"'Aviation Summary'!P14","v":0},{"$f":"'Aviation Summary'!Q14","v":0},{"$f":"'Aviation Summary'!R14","v":0},null,null,null,"Rail",{"$f":"Z232","v":0},{"$f":"AA232","v":0},0,0,0,0,0,0,0,0,0,0,null,null,"Rail","Blank","TWh"]
[null,2025,0,0,0,0,0,0,0,0,null,null,null,null,null,null,null,null,null,null,null,null,null,null,"Total Hydrogen",{"$f":"SUM(Z3:Z5)","v":0},{"$f":"SUM(AA3:AA5)","v":0},0,0,0,0,0,0,0,0,0,0,null,null,null,"Road",{"$f":"Z158","v":122939.84792012261},{"$f":"AA158","v":150302.73918505182},173932.3415673961,215387.91788801938,1113852.4583922024,2115865.2092484576,3135613.7760953088,4263750.7643033722,5775820.2414030433,15895629.186926508,26686452.764509402,34391450.261038631,null,null,null,"Blank"]
{"$rows_left_out":306}
{"sheet":"Aviation Summary","index":14,"n_rows":134,"n_cols":21,"rows_kept":134,"cut":false,"hidden":true,"merged":[[25,1,28,1],[29,1,32,1],[33,1,36,1],[10,1,13,1],[14,1,17,1],[18,1,21,1],[58,1,61,1],[62,1,65,1],[66,1,69,1],[43,1,46,1],[47,1,50,1],[51,1,54,1],[98,1,101,1],[107,1,110,1],[90,1,93,1],[94,1,97,1],[75,1,78,1],[79,1,82,1],[83,1,86,1],[122,1,125,1],[126,1,129,1],[130,1,133,1],[111,1,114,1],[115,1,118,1]]}
[null,0]
[null,null,"Scotland ATMs Analysis - Scotland ATMs Analysis"]
[]
[]
[null,null,"Summary Tables for Zero Emission Aircraft"]
[null,null,null,"D","E","F","G","H","I","J","K","L","M","N","O","P","Q","R"]
{"$rows_left_out":129}
{"sheet":"Ferries Summary","index":15,"n_rows":76,"n_cols":19,"rows_kept":76,"cut":false,"hidden":true,"merged":[[61,16,63,16],[67,16,69,16],[73,16,75,16],[9,1,11,1],[12,1,14,1],[15,1,17,1],[23,16,25,16],[29,16,31,16],[35,16,37,16],[42,16,44,16],[48,16,50,16],[54,16,56,16]]}
["OK"]
[]
[]
[null,null,null,null,"E","F","G","H","I","J","K","L","M","N","O","P"]
[null,null,null,null,null,null,null,null,null,null,null,null,null,null,null,null,null,"Lookup","Row"]
[null,null,null,null,null,null,null,null,null,null,null,null,null,null,null,null,null,{"$f":"'Key Assumptions >'!$B$21","v":"Dumfries & Galloway"},{"$f":"ROW(B21)","v":21}]
{"$rows_left_out":71}
{"sheet":"Rail Summary","index":16,"n_rows":42,"n_cols":19,"rows_kept":42,"cut":false,"hidden":true,"merged":[[9,1,11,1],[12,1,14,1],[15,1,17,1]]}
[]
[]
[]
[null,null,null,null,"E","F","G","H","I","J","K","L","M","N","O","P"]
[]
[]
{"$rows_left_out":37}
{"sheet":"Results_Backend","index":17,"n_rows":73,"n_cols":30,"rows_kept":73,"cut":false,"hidden":true,"merged":[[21,11,21,25],[36,11,36,25],[51,11,51,25],[2,11,2,25]]}
["Year","Scenario","Electricity",null,null,null,"Year","Scenario","Hydrogen "]
[2022,"Scenario A: Low Hydrogen",{"$f":"N8","v":0},null,null,null,2022,"Scenario A: Low Hydrogen",{"$f":"N9","v":122939.84792012261}]
[2023,"Scenario A: Low Hydrogen",{"$f":"O8","v":0},null,null,null,2023,"Scenario A: Low Hydrogen",{"$f":"O9","v":150302.73918505182},null,null,"To update - Toggle through regions and ensure latest data is copied into regional tabls below"]
[2024,"Scenario A: Low Hydrogen",{"$f":"P8","v":0},null,null,null,2024,"Scenario A: Low Hydrogen",{"$f":"P9","v":173932.3415673961}]
[2025,"Scenario A: Low Hydrogen",{"$f":"Q8","v":0},null,null,null,2025,"Scenario A: Low Hydrogen",{"$f":"Q9","v":215387.91788801938}]
[2026,"Scenario A: Low Hydrogen",{"$f":"R8","v":0},null,null,null,2026,"Scenario A: Low Hydrogen",{"$f":"R9","v":1113852.4583922026}]
{"$rows_left_out":68}
{"sheet":"Bus Summary","index":18,"n_rows":98,"n_cols":19,"rows_kept":98,"cut":false,"hidden":true,"merged":[[35,1,37,1],[38,1,40,1],[41,1,43,1],[9,1,11,1],[12,1,14,1],[15,1,17,1],[22,1,24,1],[25,1,27,1],[28,1,30,1]]}
[]
[]
[null,null,{"$f":"MID(CELL(\"filename\",B1),FIND(\"]\",CELL(\"filename\",B1))+1,99)","v":"Bus Summary"}]
[]
[]
[]
{"$rows_left_out":93}
{"sheet":"Car Summary","index":19,"n_rows":111,"n_cols":19,"rows_kept":111,"cut":false,"hidden":true,"merged":[[81,1,83,1],[84,1,86,1],[87,1,89,1],[45,1,45,15],[48,1,50,1],[51,1,53,1],[54,1,56,1],[78,1,78,15],[0,1,0,15],[13,1,13,15],[16,1,18,1],[19,1,21,1],[22,1,24,1],[3,1,5,1],[6,1,8,1],[9,1,11,1]]}
[null,"Lookup Table",null,null,null,null,null,null,null,null,null,null,null,null,null,null,null,"Lookup","Row"]
[1,null,null,null,"E","F","G","H","I","J","K","L","M","N","O","P",null,{"$f":"'Key Assumptions >'!B21","v":"Dumfries & Galloway"},{"$f":"ROW(B14)","v":14}]
[2,null,"TOtal","Units",2022,2023,2024,2025,2026,2027,2028,2029,2030,2035,2040,2045,null,{"$f":"'Key Assumptions >'!B22","v":"Fife"},{"$f":"ROW(B46)","v":46}]
[3,"Scenario A: Low Hydrogen","Total",null,{"$f":"E5+E6","v":118942.82192290435},{"$f":"F5+F6","v":143181.834017204},163052.82827956736,198825.14819161635,245984.52457224435,283818.10928946733,316646.75829474634,351829.62317373004,624492.32931466668,2807536.7774750302,5734048.541275301,7020654.0848212009,null,{"$f":"'Key Assumptions >'!B23","v":"Highlands"},{"$f":"ROW(B79)","v":79}]
[4,null,"Electricity","kWh",{"$f":"INDIRECT(\"'Car Summary'!\"&'Car Summary'!E$2&($A5+INDEX('Car Summary'!$S$2:$S$9,MATCH(Region,'Car Summary'!$R$2:$R$9,0))))","v":0},{"$f":"INDIRECT(\"'Car Summary'!\"&'Car Summary'!F$2&($A5+INDEX('Car Summary'!$S$2:$S$9,MATCH(Region,'Car Summary'!$R$2:$R$9,0))))","v":0},{"$f":"INDIRECT(\"'Car Summary'!\"&'Car Summary'!G$2&($A5+INDEX('Car Summary'!$S$2:$S$9,MATCH(Region,'Car Summary'!$R$2:$R$9,0))))","v":0},{"$f":"INDIRECT(\"'Car Summary'!\"&'Car Summary'!H$2&($A5+INDEX('Car Summary'!$S$2:$S$9,MATCH(Region,'Car Summary'!$R$2:$R$9,0))))","v":0},{"$f":"INDIRECT(\"'Car Summary'!\"&'Car Summary'!I$2&($A5+INDEX('Car Summary'!$S$2:$S$9,MATCH(Region,'Car Summary'!$R$2:$R$9,0))))","v":0},{"$f":"INDIRECT(\"'Car Summary'!\"&'Car Summary'!J$2&($A5+INDEX('Car Summary'!$S$2:$S$9,MATCH(Region,'Car Summary'!$R$2:$R$9,0))))","v":0},{"$f":"INDIRECT(\"'Car Summary'!\"&'Car Summary'!K$2&($A5+INDEX('Car Summary'!$S$2:$S$9,MATCH(Region,'Car Summary'!$R$2:$R$9,0))))","v":0},{"$f":"INDIRECT(\"'Car Summary'!\"&'Car Summary'!L$2&($A5+INDEX('Car Summary'!$S$2:$S$9,MATCH(Region,'Car Summary'!$R$2:$R$9,0))))","v":0},{"$f":"INDIRECT(\"'Car Summary'!\"&'Car Summary'!M$2&($A5+INDEX('Car Summary'!$S$2:$S$9,MATCH(Region,'Car Summary'!$R$2:$R$9,0))))","v":0},{"$f":"INDIRECT(\"'Car Summary'!\"&'Car Summary'!N$2&($A5+INDEX('Car Summary'!$S$2:$S$9,MATCH(Region,'Car Summary'!$R$2:$R$9,0))))","v":0},{"$f":"INDIRECT(\"'Car Summary'!\"&'Car Summary'!O$2&($A5+INDEX('Car Summary'!$S$2:$S$9,MATCH(Region,'Car Summary'!$R$2:$R$9,0))))","v":0},{"$f":"INDIRECT(\"'Car Summary'!\"&'Car Summary'!P$2&($A5+INDEX('Car Summary'!$S$2:$S$9,MATCH(Region,'Car Summary'!$R$2:$R$9,0))))","v":0}]
[5,null,"Hydrogen ","kWh",{"$f":"INDIRECT(\"'Car Summary'!\"&'Car Summary'!E$2&($A6+INDEX('Car Summary'!$S$2:$S$9,MATCH(Region,'Car Summary'!$R$2:$R$9,0))))","v":118942.82192290435},{"$f":"INDIRECT(\"'Car Summary'!\"&'Car Summary'!F$2&($A6+INDEX('Car Summary'!$S$2:$S$9,MATCH(Region,'Car Summary'!$R$2:$R$9,0))))","v":143181.834017204},{"$f":"INDIRECT(\"'Car Summary'!\"&'Car Summary'!G$2&($A6+INDEX('Car Summary'!$S$2:$S$9,MATCH(Region,'Car Summary'!$R$2:$R$9,0))))","v":163052.82827956736},{"$f":"INDIRECT(\"'Car Summary'!\"&'Car Summary'!H$2&($A6+INDEX('Car Summary'!$S$2:$S$9,MATCH(Region,'Car Summary'!$R$2:$R$9,0))))","v":198825.14819161635},{"$f":"INDIRECT(\"'Car Summary'!\"&'Car Summary'!I$2&($A6+INDEX('Car Summary'!$S$2:$S$9,MATCH(Region,'Car Summary'!$R$2:$R$9,0))))","v":245984.52457224435},{"$f":"INDIRECT(\"'Car Summary'!\"&'Car Summary'!J$2&($A6+INDEX('Car Summary'!$S$2:$S$9,MATCH(Region,'Car Summary'!$R$2:$R$9,0))))","v":283818.10928946733},{"$f":"INDIRECT(\"'Car Summary'!\"&'Car Summary'!K$2&($A6+INDEX('Car Summary'!$S$2:$S$9,MATCH(Region,'Car Summary'!$R$2:$R$9,0))))","v":316646.75829474634},{"$f":"INDIRECT(\"'Car Summary'!\"&'Car Summary'!L$2&($A6+INDEX('Car Summary'!$S$2:$S$9,MATCH(Region,'Car Summary'!$R$2:$R$9,0))))","v":351829.62317373004},{"$f":"INDIRECT(\"'Car Summary'!\"&'Car Summary'!M$2&($A6+INDEX('Car Summary'!$S$2:$S$9,MATCH(Region,'Car Summary'!$R$2:$R$9,0))))","v":624492.32931466668},{"$f":"INDIRECT(\"'Car Summary'!\"&'Car Summary'!N$2&($A6+INDEX('Car Summary'!$S$2:$S$9,MATCH(Region,'Car Summary'!$R$2:$R$9,0))))","v":2807536.7774750302},{"$f":"INDIRECT(\"'Car Summary'!\"&'Car Summary'!O$2&($A6+INDEX('Car Summary'!$S$2:$S$9,MATCH(Region,'Car Summary'!$R$2:$R$9,0))))","v":5734048.541275301},{"$f":"INDIRECT(\"'Car Summary'!\"&'Car Summary'!P$2&($A6+INDEX('Car Summary'!$S$2:$S$9,MATCH(Region,'Car Summary'!$R$2:$R$9,0))))","v":7020654.0848212009}]
{"$rows_left_out":106}
{"sheet":"HGV Summary","index":20,"n_rows":100,"n_cols":19,"rows_kept":100,"cut":false,"hidden":true,"merged":[[81,1,83,1],[43,1,43,15],[46,1,48,1],[49,1,51,1],[52,1,54,1],[0,1,0,15],[3,1,5,1],[72,1,72,15],[75,1,77,1],[78,1,80,1],[6,1,8,1],[9,1,11,1],[13,1,13,15],[16,1,18,1],[19,1,21,1],[22,1,24,1]]}
[null,"Lookup Table",null,null,null,null,null,null,null,null,null,null,null,null,null,null,null,"Lookup","Row"]
[1,null,null,null,"E","F","G","H","I","J","K","L","M","N","O","P",null,{"$f":"'Key Assumptions >'!B21","v":"Dumfries & Galloway"},{"$f":"ROW(B14)","v":14}]
[2,null,"Total","Units",2022,2023,2024,2025,2026,2027,2028,2029,2030,2035,2040,2045,null,{"$f":"'Key Assumptions >'!B22","v":"Fife"},{"$f":"ROW(B44)","v":44}]
[3,"Scenario A: Low Hydrogen","Total",null,{"$f":"E5+E6","v":0},0,0,0,842904.11232811678,1797855.7245349402,2775506.0665589934,3860613.062837034,5035286.8016929673,11586497.058379136,18704054.414246533,25008752.819101635,null,{"$f":"'Key Assumptions >'!B23","v":"Highlands"},{"$f":"ROW(B73)","v":73}]
[4,null,"Electricity","kWh",{"$f":"INDIRECT(\"'HGV Summary'!\"&'HGV Summary'!E$2&($A5+INDEX('HGV Summary'!$S$2:$S$9,MATCH(Region,'HGV Summary'!$R$2:$R$9,0))))","v":0},{"$f":"INDIRECT(\"'HGV Summary'!\"&'HGV Summary'!F$2&($A5+INDEX('HGV Summary'!$S$2:$S$9,MATCH(Region,'HGV Summary'!$R$2:$R$9,0))))","v":0},{"$f":"INDIRECT(\"'HGV Summary'!\"&'HGV Summary'!G$2&($A5+INDEX('HGV Summary'!$S$2:$S$9,MATCH(Region,'HGV Summary'!$R$2:$R$9,0))))","v":0},{"$f":"INDIRECT(\"'HGV Summary'!\"&'HGV Summary'!H$2&($A5+INDEX('HGV Summary'!$S$2:$S$9,MATCH(Region,'HGV Summary'!$R$2:$R$9,0))))","v":0},{"$f":"INDIRECT(\"'HGV Summary'!\"&'HGV Summary'!I$2&($A5+INDEX('HGV Summary'!$S$2:$S$9,MATCH(Region,'HGV Summary'!$R$2:$R$9,0))))","v":0},{"$f":"INDIRECT(\"'HGV Summary'!\"&'HGV Summary'!J$2&($A5+INDEX('HGV Summary'!$S$2:$S$9,MATCH(Region,'HGV Summary'!$R$2:$R$9,0))))","v":0},{"$f":"INDIRECT(\"'HGV Summary'!\"&'HGV Summary'!K$2&($A5+INDEX('HGV Summary'!$S$2:$S$9,MATCH(Region,'HGV Summary'!$R$2:$R$9,0))))","v":0},{"$f":"INDIRECT(\"'HGV Summary'!\"&'HGV Summary'!L$2&($A5+INDEX('HGV Summary'!$S$2:$S$9,MATCH(Region,'HGV Summary'!$R$2:$R$9,0))))","v":0},{"$f":"INDIRECT(\"'HGV Summary'!\"&'HGV Summary'!M$2&($A5+INDEX('HGV Summary'!$S$2:$S$9,MATCH(Region,'HGV Summary'!$R$2:$R$9,0))))","v":0},{"$f":"INDIRECT(\"'HGV Summary'!\"&'HGV Summary'!N$2&($A5+INDEX('HGV Summary'!$S$2:$S$9,MATCH(Region,'HGV Summary'!$R$2:$R$9,0))))","v":0},{"$f":"INDIRECT(\"'HGV Summary'!\"&'HGV Summary'!O$2&($A5+INDEX('HGV Summary'!$S$2:$S$9,MATCH(Region,'HGV Summary'!$R$2:$R$9,0))))","v":0},{"$f":"INDIRECT(\"'HGV Summary'!\"&'HGV Summary'!P$2&($A5+INDEX('HGV Summary'!$S$2:$S$9,MATCH(Region,'HGV Summary'!$R$2:$R$9,0))))","v":0}]
[5,null,"Hydrogen ","kWh",{"$f":"INDIRECT(\"'HGV Summary'!\"&'HGV Summary'!E$2&($A6+INDEX('HGV Summary'!$S$2:$S$9,MATCH(Region,'HGV Summary'!$R$2:$R$9,0))))","v":0},{"$f":"INDIRECT(\"'HGV Summary'!\"&'HGV Summary'!F$2&($A6+INDEX('HGV Summary'!$S$2:$S$9,MATCH(Region,'HGV Summary'!$R$2:$R$9,0))))","v":0},{"$f":"INDIRECT(\"'HGV Summary'!\"&'HGV Summary'!G$2&($A6+INDEX('HGV Summary'!$S$2:$S$9,MATCH(Region,'HGV Summary'!$R$2:$R$9,0))))","v":0},{"$f":"INDIRECT(\"'HGV Summary'!\"&'HGV Summary'!H$2&($A6+INDEX('HGV Summary'!$S$2:$S$9,MATCH(Region,'HGV Summary'!$R$2:$R$9,0))))","v":0},{"$f":"INDIRECT(\"'HGV Summary'!\"&'HGV Summary'!I$2&($A6+INDEX('HGV Summary'!$S$2:$S$9,MATCH(Region,'HGV Summary'!$R$2:$R$9,0))))","v":842904.11232811678},{"$f":"INDIRECT(\"'HGV Summary'!\"&'HGV Summary'!J$2&($A6+INDEX('HGV Summary'!$S$2:$S$9,MATCH(Region,'HGV Summary'!$R$2:$R$9,0))))","v":1797855.7245349402},{"$f":"INDIRECT(\"'HGV Summary'!\"&'HGV Summary'!K$2&($A6+INDEX('HGV Summary'!$S$2:$S$9,MATCH(Region,'HGV Summary'!$R$2:$R$9,0))))","v":2775506.0665589934},{"$f":"INDIRECT(\"'HGV Summary'!\"&'HGV Summary'!L$2&($A6+INDEX('HGV Summary'!$S$2:$S$9,MATCH(Region,'HGV Summary'!$R$2:$R$9,0))))","v":3860613.062837034},{"$f":"INDIRECT(\"'HGV Summary'!\"&'HGV Summary'!M$2&($A6+INDEX('HGV Summary'!$S$2:$S$9,MATCH(Region,'HGV Summary'!$R$2:$R$9,0))))","v":5035286.8016929673},{"$f":"INDIRECT(\"'HGV Summary'!\"&'HGV Summary'!N$2&($A6+INDEX('HGV Summary'!$S$2:$S$9,MATCH(Region,'HGV Summary'!$R$2:$R$9,0))))","v":11586497.058379136},{"$f":"INDIRECT(\"'HGV Summary'!\"&'HGV Summary'!O$2&($A6+INDEX('HGV Summary'!$S$2:$S$9,MATCH(Region,'HGV Summary'!$R$2:$R$9,0))))","v":18704054.414246533},{"$f":"INDIRECT(\"'HGV Summary'!\"&'HGV Summary'!P$2&($A6+INDEX('HGV Summary'!$S$2:$S$9,MATCH(Region,'HGV Summary'!$R$2:$R$9,0))))","v":25008752.819101635}]
{"$rows_left_out":95}
{"sheet":"Van Summary","index":21,"n_rows":98,"n_cols":19,"rows_kept":98,"cut":false,"hidden":true,"merged":[[42,1,42,15],[45,1,47,1],[0,1,0,15],[14,1,14,15],[17,1,19,1],[20,1,22,1],[23,1,25,1],[3,1,5,1],[6,1,8,1],[9,1,11,1],[71,1,71,15],[74,1,76,1],[77,1,79,1],[80,1,82,1],[48,1,50,1],[51,1,53,1]]}
[null,"Lookup Table",null,null,null,null,null,null,null,null,null,null,null,null,null,null,null,"Lookup","Row"]
[1,null,null,null,"E","F","G","H","I","J","K","L","M","N","O","P",null,{"$f":"'Key Assumptions >'!B21","v":"Dumfries & Galloway"},{"$f":"ROW(B15)","v":15}]
[2,null,"TOtal","Units",2022,2023,2024,2025,2026,2027,2028,2029,2030,2035,2040,2045,null,{"$f":"'Key Assumptions >'!B22","v":"Fife"},{"$f":"ROW(B43)","v":43}]
[3,"Scenario A: Low Hydrogen","Total",null,{"$f":"E5+E6","v":3997.0259972182671},{"$f":"F5+F6","v":7120.9051678477999},10879.513287828733,16562.769696403033,24963.821491841401,34191.375424050006,43460.951241568997,51308.078292608334,116041.11039540902,458651.92481432337,683934.6696005367,797628.21772876685,null,{"$f":"'Key Assumptions >'!B23","v":"Highlands"},{"$f":"ROW(B72)","v":72}]
[4,null,"Electricity","kWh",{"$f":"INDIRECT(\"'Van Summary'!\"&'Van Summary'!E$2&($A5+INDEX('Van Summary'!$S$2:$S$9,MATCH(Region,'Van Summary'!$R$2:$R$9,0))))","v":0},{"$f":"INDIRECT(\"'Van Summary'!\"&'Van Summary'!F$2&($A5+INDEX('Van Summary'!$S$2:$S$9,MATCH(Region,'Van Summary'!$R$2:$R$9,0))))","v":0},{"$f":"INDIRECT(\"'Van Summary'!\"&'Van Summary'!G$2&($A5+INDEX('Van Summary'!$S$2:$S$9,MATCH(Region,'Van Summary'!$R$2:$R$9,0))))","v":0},{"$f":"INDIRECT(\"'Van Summary'!\"&'Van Summary'!H$2&($A5+INDEX('Van Summary'!$S$2:$S$9,MATCH(Region,'Van Summary'!$R$2:$R$9,0))))","v":0},{"$f":"INDIRECT(\"'Van Summary'!\"&'Van Summary'!I$2&($A5+INDEX('Van Summary'!$S$2:$S$9,MATCH(Region,'Van Summary'!$R$2:$R$9,0))))","v":0},{"$f":"INDIRECT(\"'Van Summary'!\"&'Van Summary'!J$2&($A5+INDEX('Van Summary'!$S$2:$S$9,MATCH(Region,'Van Summary'!$R$2:$R$9,0))))","v":0},{"$f":"INDIRECT(\"'Van Summary'!\"&'Van Summary'!K$2&($A5+INDEX('Van Summary'!$S$2:$S$9,MATCH(Region,'Van Summary'!$R$2:$R$9,0))))","v":0},{"$f":"INDIRECT(\"'Van Summary'!\"&'Van Summary'!L$2&($A5+INDEX('Van Summary'!$S$2:$S$9,MATCH(Region,'Van Summary'!$R$2:$R$9,0))))","v":0},{"$f":"INDIRECT(\"'Van Summary'!\"&'Van Summary'!M$2&($A5+INDEX('Van Summary'!$S$2:$S$9,MATCH(Region,'Van Summary'!$R$2:$R$9,0))))","v":0},{"$f":"INDIRECT(\"'Van Summary'!\"&'Van Summary'!N$2&($A5+INDEX('Van Summary'!$S$2:$S$9,MATCH(Region,'Van Summary'!$R$2:$R$9,0))))","v":0},{"$f":"INDIRECT(\"'Van Summary'!\"&'Van Summary'!O$2&($A5+INDEX('Van Summary'!$S$2:$S$9,MATCH(Region,'Van Summary'!$R$2:$R$9,0))))","v":0},{"$f":"INDIRECT(\"'Van Summary'!\"&'Van Summary'!P$2&($A5+INDEX('Van Summary'!$S$2:$S$9,MATCH(Region,'Van Summary'!$R$2:$R$9,0))))","v":0}]
[5,null,"Hydrogen ","kWh",{"$f":"INDIRECT(\"'Van Summary'!\"&'Van Summary'!E$2&($A6+INDEX('Van Summary'!$S$2:$S$9,MATCH(Region,'Van Summary'!$R$2:$R$9,0))))","v":3997.0259972182671},{"$f":"INDIRECT(\"'Van Summary'!\"&'Van Summary'!F$2&($A6+INDEX('Van Summary'!$S$2:$S$9,MATCH(Region,'Van Summary'!$R$2:$R$9,0))))","v":7120.9051678477999},{"$f":"INDIRECT(\"'Van Summary'!\"&'Van Summary'!G$2&($A6+INDEX('Van Summary'!$S$2:$S$9,MATCH(Region,'Van Summary'!$R$2:$R$9,0))))","v":10879.513287828733},{"$f":"INDIRECT(\"'Van Summary'!\"&'Van Summary'!H$2&($A6+INDEX('Van Summary'!$S$2:$S$9,MATCH(Region,'Van Summary'!$R$2:$R$9,0))))","v":16562.769696403033},{"$f":"INDIRECT(\"'Van Summary'!\"&'Van Summary'!I$2&($A6+INDEX('Van Summary'!$S$2:$S$9,MATCH(Region,'Van Summary'!$R$2:$R$9,0))))","v":24963.821491841401},{"$f":"INDIRECT(\"'Van Summary'!\"&'Van Summary'!J$2&($A6+INDEX('Van Summary'!$S$2:$S$9,MATCH(Region,'Van Summary'!$R$2:$R$9,0))))","v":34191.375424050006},{"$f":"INDIRECT(\"'Van Summary'!\"&'Van Summary'!K$2&($A6+INDEX('Van Summary'!$S$2:$S$9,MATCH(Region,'Van Summary'!$R$2:$R$9,0))))","v":43460.951241568997},{"$f":"INDIRECT(\"'Van Summary'!\"&'Van Summary'!L$2&($A6+INDEX('Van Summary'!$S$2:$S$9,MATCH(Region,'Van Summary'!$R$2:$R$9,0))))","v":51308.078292608334},{"$f":"INDIRECT(\"'Van Summary'!\"&'Van Summary'!M$2&($A6+INDEX('Van Summary'!$S$2:$S$9,MATCH(Region,'Van Summary'!$R$2:$R$9,0))))","v":116041.11039540902},{"$f":"INDIRECT(\"'Van Summary'!\"&'Van Summary'!N$2&($A6+INDEX('Van Summary'!$S$2:$S$9,MATCH(Region,'Van Summary'!$R$2:$R$9,0))))","v":458651.92481432337},{"$f":"INDIRECT(\"'Van Summary'!\"&'Van Summary'!O$2&($A6+INDEX('Van Summary'!$S$2:$S$9,MATCH(Region,'Van Summary'!$R$2:$R$9,0))))","v":683934.6696005367},{"$f":"INDIRECT(\"'Van Summary'!\"&'Van Summary'!P$2&($A6+INDEX('Van Summary'!$S$2:$S$9,MATCH(Region,'Van Summary'!$R$2:$R$9,0))))","v":797628.21772876685}]
{"$rows_left_out":92}